{"text_format":"1","workbook":"xlsx","n_sheets":5,"sheets":["Template Items","Swam Monthly Report","Form Instructions","Email info","S W M Options"],"not_rendered":{"charts":0,"images":3,"macros":1,"external_links":0,"defined_names":5,"comments":0,"pivot_tables":0},"unopened":[],"bounds":{"document_bytes":16777216,"sheet_cells":100000,"rows_first":2000,"rows_last":500,"rows_between":2000,"halvings":0,"cell_chars":16384,"cell_head_chars":4096},"cells_cut":0,"cells_raw":0,"read":"whole","date_system":"1900"}

{"sheet":"Template Items","index":0,"n_rows":100,"n_cols":17,"rows_kept":100,"cut":false,"hidden":false,"merged":[]}
["Project Code","Project Title","Contractor Name","Total Contract Value","Invoice Number","For Period From:","For Period To:","Subcont. FEIN ID #\n(No SSN's)","S W M","SWaM Cert#","SWaM Cert. Exp Date","Vendor Name","Phone No.","Item Description","Previous Payments","Current Payments","Cumulative Payments"]
[{"$f":"IF($L2=\"\",\"\",'Swam Monthly Report'!$C$5)","v":"204-45678-910"},{"$f":"IF($L2=\"\",\"\",'Swam Monthly Report'!$C$4)","v":"Project A"},{"$f":"IF($L2=\"\",\"\",'Swam Monthly Report'!$C$3)","v":"Contractor A"},{"$f":"IF($L2=\"\",\"\",'Swam Monthly Report'!$C$8)","v":1000000},{"$f":"IF($L2=\"\",\"\",'Swam Monthly Report'!$C$2)","v":123456},{"$f":"IF($L2=\"\",\"\",'Swam Monthly Report'!$H$2)","v":"2021-11-01"},{"$f":"IF($L2=\"\",\"\",'Swam Monthly Report'!$J$2)","v":"2021-11-30"},"xx-xxxxx","SBE",671876,"2024-10-15","Contractor A","(xxx) xxx-xxxx","Demolition",1,0.1,{"$f":"IF(SUM(O2:P2)=0,\"\",(SUM(O2:P2)))","v":1.1000000000000001}]
[{"$f":"IF($L3=\"\",\"\",'Swam Monthly Report'!$C$5)","v":"204-45678-910"},{"$f":"IF($L3=\"\",\"\",'Swam Monthly Report'!$C$4)","v":"Project A"},{"$f":"IF($L3=\"\",\"\",'Swam Monthly Report'!$C$3)","v":"Contractor A"},{"$f":"IF($L3=\"\",\"\",'Swam Monthly Report'!$C$8)","v":1000000},{"$f":"IF($L3=\"\",\"\",'Swam Monthly Report'!$C$2)","v":123456},{"$f":"IF($L3=\"\",\"\",'Swam Monthly Report'!$H$2)","v":"2021-11-01"},{"$f":"IF($L3=\"\",\"\",'Swam Monthly Report'!$J$2)","v":"2021-11-30"},null,"MBE",null,null,"Subcontractor A","(xxx) xxx-xxxx","Rebar",1,0.1,{"$f":"IF(SUM(O3:P3)=0,\"\",(SUM(O3:P3)))","v":1.1000000000000001}]
[{"$f":"IF($L4=\"\",\"\",'Swam Monthly Report'!$C$5)","v":"204-45678-910"},{"$f":"IF($L4=\"\",\"\",'Swam Monthly Report'!$C$4)","v":"Project A"},{"$f":"IF($L4=\"\",\"\",'Swam Monthly Report'!$C$3)","v":"Contractor A"},{"$f":"IF($L4=\"\",\"\",'Swam Monthly Report'!$C$8)","v":1000000},{"$f":"IF($L4=\"\",\"\",'Swam Monthly Report'!$C$2)","v":123456},{"$f":"IF($L4=\"\",\"\",'Swam Monthly Report'!$H$2)","v":"2021-11-01"},{"$f":"IF($L4=\"\",\"\",'Swam Monthly Report'!$J$2)","v":"2021-11-30"},"xx-xxxxx","SBE",9936,"2025-06-17","Subcontractor B","(xxx) xxx-xxxx","Steel",1,0.1,1.1000000000000001]
[{"$f":"IF($L5=\"\",\"\",'Swam Monthly Report'!$C$5)","v":"204-45678-910"},{"$f":"IF($L5=\"\",\"\",'Swam Monthly Report'!$C$4)","v":"Project A"},{"$f":"IF($L5=\"\",\"\",'Swam Monthly Report'!$C$3)","v":"Contractor A"},{"$f":"IF($L5=\"\",\"\",'Swam Monthly Report'!$C$8)","v":1000000},{"$f":"IF($L5=\"\",\"\",'Swam Monthly Report'!$C$2)","v":123456},{"$f":"IF($L5=\"\",\"\",'Swam Monthly Report'!$H$2)","v":"2021-11-01"},{"$f":"IF($L5=\"\",\"\",'Swam Monthly Report'!$J$2)","v":"2021-11-30"},null,"Veteran",null,null,"Subcontractor C","(xxx) xxx-xxxx","Steel",1,0.1,1.1000000000000001]
[{"$f":"IF($L6=\"\",\"\",'Swam Monthly Report'!$C$5)","v":"204-45678-910"},{"$f":"IF($L6=\"\",\"\",'Swam Monthly Report'!$C$4)","v":"Project A"},{"$f":"IF($L6=\"\",\"\",'Swam Monthly Report'!$C$3)","v":"Contractor A"},{"$f":"IF($L6=\"\",\"\",'Swam Monthly Report'!$C$8)","v":1000000},{"$f":"IF($L6=\"\",\"\",'Swam Monthly Report'!$C$2)","v":123456},{"$f":"IF($L6=\"\",\"\",'Swam Monthly Report'!$H$2)","v":"2021-11-01"},{"$f":"IF($L6=\"\",\"\",'Swam Monthly Report'!$J$2)","v":"2021-11-30"},"xx-xxxxx","WSBE",648231,"2023-12-19","Subcontractor D","(xxx) xxx-xxxx","Steel",1,0.1,1.1000000000000001]
[{"$f":"IF($L7=\"\",\"\",'Swam Monthly Report'!$C$5)","v":"204-45678-910"},{"$f":"IF($L7=\"\",\"\",'Swam Monthly Report'!$C$4)","v":"Project A"},{"$f":"IF($L7=\"\",\"\",'Swam Monthly Report'!$C$3)","v":"Contractor A"},{"$f":"IF($L7=\"\",\"\",'Swam Monthly Report'!$C$8)","v":1000000},{"$f":"IF($L7=\"\",\"\",'Swam Monthly Report'!$C$2)","v":123456},{"$f":"IF($L7=\"\",\"\",'Swam Monthly Report'!$H$2)","v":"2021-11-01"},{"$f":"IF($L7=\"\",\"\",'Swam Monthly Report'!$J$2)","v":"2021-11-30"},"xx-xxxxx","SBE",649349,"2023-01-19","Subcontractor E","(xxx) xxx-xxxx","Steel",1,0.1,1.1000000000000001]
[{"$f":"IF($L8=\"\",\"\",'Swam Monthly Report'!$C$5)","v":"204-45678-910"},{"$f":"IF($L8=\"\",\"\",'Swam Monthly Report'!$C$4)","v":"Project A"},{"$f":"IF($L8=\"\",\"\",'Swam Monthly Report'!$C$3)","v":"Contractor A"},{"$f":"IF($L8=\"\",\"\",'Swam Monthly Report'!$C$8)","v":1000000},{"$f":"IF($L8=\"\",\"\",'Swam Monthly Report'!$C$2)","v":123456},{"$f":"IF($L8=\"\",\"\",'Swam Monthly Report'!$H$2)","v":"2021-11-01"},{"$f":"IF($L8=\"\",\"\",'Swam Monthly Report'!$J$2)","v":"2021-11-30"},null,"OBE",649349,"2023-01-19","Subcontractor F","(xxx) xxx-xxxx","Steel",1,0.1,1.1000000000000001]
[{"$f":"IF($L9=\"\",\"\",'Swam Monthly Report'!$C$5)","v":"204-45678-910"},{"$f":"IF($L9=\"\",\"\",'Swam Monthly Report'!$C$4)","v":"Project A"},{"$f":"IF($L9=\"\",\"\",'Swam Monthly Report'!$C$3)","v":"Contractor A"},{"$f":"IF($L9=\"\",\"\",'Swam Monthly Report'!$C$8)","v":1000000},{"$f":"IF($L9=\"\",\"\",'Swam Monthly Report'!$C$2)","v":123456},{"$f":"IF($L9=\"\",\"\",'Swam Monthly Report'!$H$2)","v":"2021-11-01"},{"$f":"IF($L9=\"\",\"\",'Swam Monthly Report'!$J$2)","v":"2021-11-30"},"xx-xxxxx","SBE",706447,"2025-12-22","Subcontractor G","(xxx) xxx-xxxx","Steel",1,0.1,1.1000000000000001]
[{"$f":"IF($L10=\"\",\"\",'Swam Monthly Report'!$C$5)","v":"204-45678-910"},{"$f":"IF($L10=\"\",\"\",'Swam Monthly Report'!$C$4)","v":"Project A"},{"$f":"IF($L10=\"\",\"\",'Swam Monthly Report'!$C$3)","v":"Contractor A"},{"$f":"IF($L10=\"\",\"\",'Swam Monthly Report'!$C$8)","v":1000000},{"$f":"IF($L10=\"\",\"\",'Swam Monthly Report'!$C$2)","v":123456},{"$f":"IF($L10=\"\",\"\",'Swam Monthly Report'!$H$2)","v":"2021-11-01"},{"$f":"IF($L10=\"\",\"\",'Swam Monthly Report'!$J$2)","v":"2021-11-30"},"xx-xxxxx","SBE",659041,"2024-07-24","Subcontractor H","(xxx) xxx-xxxx","Steel",1,0.1,1.1000000000000001]
[{"$f":"IF($L11=\"\",\"\",'Swam Monthly Report'!$C$5)","v":"204-45678-910"},{"$f":"IF($L11=\"\",\"\",'Swam Monthly Report'!$C$4)","v":"Project A"},{"$f":"IF($L11=\"\",\"\",'Swam Monthly Report'!$C$3)","v":"Contractor A"},{"$f":"IF($L11=\"\",\"\",'Swam Monthly Report'!$C$8)","v":1000000},{"$f":"IF($L11=\"\",\"\",'Swam Monthly Report'!$C$2)","v":123456},{"$f":"IF($L11=\"\",\"\",'Swam Monthly Report'!$H$2)","v":"2021-11-01"},{"$f":"IF($L11=\"\",\"\",'Swam Monthly Report'!$J$2)","v":"2021-11-30"},"xx-xxxxx",null,649349,"2023-01-19","Subcontractor I","(xxx) xxx-xxxx","Steel",1,0.1,1.1000000000000001]
[{"$f":"IF($L12=\"\",\"\",'Swam Monthly Report'!$C$5)","v":""},{"$f":"IF($L12=\"\",\"\",'Swam Monthly Report'!$C$4)","v":""},{"$f":"IF($L12=\"\",\"\",'Swam Monthly Report'!$C$3)","v":""},{"$f":"IF($L12=\"\",\"\",'Swam Monthly Report'!$C$8)","v":""},{"$f":"IF($L12=\"\",\"\",'Swam Monthly Report'!$C$2)","v":""},{"$f":"IF($L12=\"\",\"\",'Swam Monthly Report'!$H$2)","v":""},{"$f":"IF($L12=\"\",\"\",'Swam Monthly Report'!$J$2)","v":""},null,null,null,null,null,null,null,null,null,""]
[{"$f":"IF($L13=\"\",\"\",'Swam Monthly Report'!$C$5)","v":""},{"$f":"IF($L13=\"\",\"\",'Swam Monthly Report'!$C$4)","v":""},{"$f":"IF($L13=\"\",\"\",'Swam Monthly Report'!$C$3)","v":""},{"$f":"IF($L13=\"\",\"\",'Swam Monthly Report'!$C$8)","v":""},{"$f":"IF($L13=\"\",\"\",'Swam Monthly Report'!$C$2)","v":""},{"$f":"IF($L13=\"\",\"\",'Swam Monthly Report'!$H$2)","v":""},{"$f":"IF($L13=\"\",\"\",'Swam Monthly Report'!$J$2)","v":""},null,null,null,null,null,null,null,null,null,""]
[{"$f":"IF($L14=\"\",\"\",'Swam Monthly Report'!$C$5)","v":""},{"$f":"IF($L14=\"\",\"\",'Swam Monthly Report'!$C$4)","v":""},{"$f":"IF($L14=\"\",\"\",'Swam Monthly Report'!$C$3)","v":""},{"$f":"IF($L14=\"\",\"\",'Swam Monthly Report'!$C$8)","v":""},{"$f":"IF($L14=\"\",\"\",'Swam Monthly Report'!$C$2)","v":""},{"$f":"IF($L14=\"\",\"\",'Swam Monthly Report'!$H$2)","v":""},{"$f":"IF($L14=\"\",\"\",'Swam Monthly Report'!$J$2)","v":""},null,null,null,null,null,null,null,null,null,""]
[{"$f":"IF($L15=\"\",\"\",'Swam Monthly Report'!$C$5)","v":""},{"$f":"IF($L15=\"\",\"\",'Swam Monthly Report'!$C$4)","v":""},{"$f":"IF($L15=\"\",\"\",'Swam Monthly Report'!$C$3)","v":""},{"$f":"IF($L15=\"\",\"\",'Swam Monthly Report'!$C$8)","v":""},{"$f":"IF($L15=\"\",\"\",'Swam Monthly Report'!$C$2)","v":""},{"$f":"IF($L15=\"\",\"\",'Swam Monthly Report'!$H$2)","v":""},{"$f":"IF($L15=\"\",\"\",'Swam Monthly Report'!$J$2)","v":""},null,null,null,null,null,null,null,null,null,""]
[{"$f":"IF($L16=\"\",\"\",'Swam Monthly Report'!$C$5)","v":""},{"$f":"IF($L16=\"\",\"\",'Swam Monthly Report'!$C$4)","v":""},{"$f":"IF($L16=\"\",\"\",'Swam Monthly Report'!$C$3)","v":""},{"$f":"IF($L16=\"\",\"\",'Swam Monthly Report'!$C$8)","v":""},{"$f":"IF($L16=\"\",\"\",'Swam Monthly Report'!$C$2)","v":""},{"$f":"IF($L16=\"\",\"\",'Swam Monthly Report'!$H$2)","v":""},{"$f":"IF($L16=\"\",\"\",'Swam Monthly Report'!$J$2)","v":""},null,null,null,null,null,null,null,null,null,""]
[{"$f":"IF($L17=\"\",\"\",'Swam Monthly Report'!$C$5)","v":""},{"$f":"IF($L17=\"\",\"\",'Swam Monthly Report'!$C$4)","v":""},{"$f":"IF($L17=\"\",\"\",'Swam Monthly Report'!$C$3)","v":""},{"$f":"IF($L17=\"\",\"\",'Swam Monthly Report'!$C$8)","v":""},{"$f":"IF($L17=\"\",\"\",'Swam Monthly Report'!$C$2)","v":""},{"$f":"IF($L17=\"\",\"\",'Swam Monthly Report'!$H$2)","v":""},{"$f":"IF($L17=\"\",\"\",'Swam Monthly Report'!$J$2)","v":""},null,null,null,null,null,null,null,null,null,""]
[{"$f":"IF($L18=\"\",\"\",'Swam Monthly Report'!$C$5)","v":""},{"$f":"IF($L18=\"\",\"\",'Swam Monthly Report'!$C$4)","v":""},{"$f":"IF($L18=\"\",\"\",'Swam Monthly Report'!$C$3)","v":""},{"$f":"IF($L18=\"\",\"\",'Swam Monthly Report'!$C$8)","v":""},{"$f":"IF($L18=\"\",\"\",'Swam Monthly Report'!$C$2)","v":""},{"$f":"IF($L18=\"\",\"\",'Swam Monthly Report'!$H$2)","v":""},{"$f":"IF($L18=\"\",\"\",'Swam Monthly Report'!$J$2)","v":""},null,null,null,null,null,null,null,null,null,""]
[{"$f":"IF($L19=\"\",\"\",'Swam Monthly Report'!$C$5)","v":""},{"$f":"IF($L19=\"\",\"\",'Swam Monthly Report'!$C$4)","v":""},{"$f":"IF($L19=\"\",\"\",'Swam Monthly Report'!$C$3)","v":""},{"$f":"IF($L19=\"\",\"\",'Swam Monthly Report'!$C$8)","v":""},{"$f":"IF($L19=\"\",\"\",'Swam Monthly Report'!$C$2)","v":""},{"$f":"IF($L19=\"\",\"\",'Swam Monthly Report'!$H$2)","v":""},{"$f":"IF($L19=\"\",\"\",'Swam Monthly Report'!$J$2)","v":""},null,null,null,null,null,null,null,null,null,""]
[{"$f":"IF($L20=\"\",\"\",'Swam Monthly Report'!$C$5)","v":""},{"$f":"IF($L20=\"\",\"\",'Swam Monthly Report'!$C$4)","v":""},{"$f":"IF($L20=\"\",\"\",'Swam Monthly Report'!$C$3)","v":""},{"$f":"IF($L20=\"\",\"\",'Swam Monthly Report'!$C$8)","v":""},{"$f":"IF($L20=\"\",\"\",'Swam Monthly Report'!$C$2)","v":""},{"$f":"IF($L20=\"\",\"\",'Swam Monthly Report'!$H$2)","v":""},{"$f":"IF($L20=\"\",\"\",'Swam Monthly Report'!$J$2)","v":""},null,null,null,null,null,null,null,null,null,""]
[{"$f":"IF($L21=\"\",\"\",'Swam Monthly Report'!$C$5)","v":""},{"$f":"IF($L21=\"\",\"\",'Swam Monthly Report'!$C$4)","v":""},{"$f":"IF($L21=\"\",\"\",'Swam Monthly Report'!$C$3)","v":""},{"$f":"IF($L21=\"\",\"\",'Swam Monthly Report'!$C$8)","v":""},{"$f":"IF($L21=\"\",\"\",'Swam Monthly Report'!$C$2)","v":""},{"$f":"IF($L21=\"\",\"\",'Swam Monthly Report'!$H$2)","v":""},{"$f":"IF($L21=\"\",\"\",'Swam Monthly Report'!$J$2)","v":""},null,null,null,null,null,null,null,null,null,""]
[{"$f":"IF($L22=\"\",\"\",'Swam Monthly Report'!$C$5)","v":""},{"$f":"IF($L22=\"\",\"\",'Swam Monthly Report'!$C$4)","v":""},{"$f":"IF($L22=\"\",\"\",'Swam Monthly Report'!$C$3)","v":""},{"$f":"IF($L22=\"\",\"\",'Swam Monthly Report'!$C$8)","v":""},{"$f":"IF($L22=\"\",\"\",'Swam Monthly Report'!$C$2)","v":""},{"$f":"IF($L22=\"\",\"\",'Swam Monthly Report'!$H$2)","v":""},{"$f":"IF($L22=\"\",\"\",'Swam Monthly Report'!$J$2)","v":""},null,null,null,null,null,null,null,null,null,""]
[{"$f":"IF($L23=\"\",\"\",'Swam Monthly Report'!$C$5)","v":""},{"$f":"IF($L23=\"\",\"\",'Swam Monthly Report'!$C$4)","v":""},{"$f":"IF($L23=\"\",\"\",'Swam Monthly Report'!$C$3)","v":""},{"$f":"IF($L23=\"\",\"\",'Swam Monthly Report'!$C$8)","v":""},{"$f":"IF($L23=\"\",\"\",'Swam Monthly Report'!$C$2)","v":""},{"$f":"IF($L23=\"\",\"\",'Swam Monthly Report'!$H$2)","v":""},{"$f":"IF($L23=\"\",\"\",'Swam Monthly Report'!$J$2)","v":""},null,null,null,null,null,null,null,null,null,""]
[{"$f":"IF($L24=\"\",\"\",'Swam Monthly Report'!$C$5)","v":""},{"$f":"IF($L24=\"\",\"\",'Swam Monthly Report'!$C$4)","v":""},{"$f":"IF($L24=\"\",\"\",'Swam Monthly Report'!$C$3)","v":""},{"$f":"IF($L24=\"\",\"\",'Swam Monthly Report'!$C$8)","v":""},{"$f":"IF($L24=\"\",\"\",'Swam Monthly Report'!$C$2)","v":""},{"$f":"IF($L24=\"\",\"\",'Swam Monthly Report'!$H$2)","v":""},{"$f":"IF($L24=\"\",\"\",'Swam Monthly Report'!$J$2)","v":""},null,null,null,null,null,null,null,null,null,""]
[{"$f":"IF($L25=\"\",\"\",'Swam Monthly Report'!$C$5)","v":""},{"$f":"IF($L25=\"\",\"\",'Swam Monthly Report'!$C$4)","v":""},{"$f":"IF($L25=\"\",\"\",'Swam Monthly Report'!$C$3)","v":""},{"$f":"IF($L25=\"\",\"\",'Swam Monthly Report'!$C$8)","v":""},{"$f":"IF($L25=\"\",\"\",'Swam Monthly Report'!$C$2)","v":""},{"$f":"IF($L25=\"\",\"\",'Swam Monthly Report'!$H$2)","v":""},{"$f":"IF($L25=\"\",\"\",'Swam Monthly Report'!$J$2)","v":""},null,null,null,null,null,null,null,null,null,""]
[{"$f":"IF($L26=\"\",\"\",'Swam Monthly Report'!$C$5)","v":""},{"$f":"IF($L26=\"\",\"\",'Swam Monthly Report'!$C$4)","v":""},{"$f":"IF($L26=\"\",\"\",'Swam Monthly Report'!$C$3)","v":""},{"$f":"IF($L26=\"\",\"\",'Swam Monthly Report'!$C$8)","v":""},{"$f":"IF($L26=\"\",\"\",'Swam Monthly Report'!$C$2)","v":""},{"$f":"IF($L26=\"\",\"\",'Swam Monthly Report'!$H$2)","v":""},{"$f":"IF($L26=\"\",\"\",'Swam Monthly Report'!$J$2)","v":""},null,null,null,null,null,null,null,null,null,""]
[{"$f":"IF($L27=\"\",\"\",'Swam Monthly Report'!$C$5)","v":""},{"$f":"IF($L27=\"\",\"\",'Swam Monthly Report'!$C$4)","v":""},{"$f":"IF($L27=\"\",\"\",'Swam Monthly Report'!$C$3)","v":""},{"$f":"IF($L27=\"\",\"\",'Swam Monthly Report'!$C$8)","v":""},{"$f":"IF($L27=\"\",\"\",'Swam Monthly Report'!$C$2)","v":""},{"$f":"IF($L27=\"\",\"\",'Swam Monthly Report'!$H$2)","v":""},{"$f":"IF($L27=\"\",\"\",'Swam Monthly Report'!$J$2)","v":""},null,null,null,null,null,null,null,null,null,""]
[{"$f":"IF($L28=\"\",\"\",'Swam Monthly Report'!$C$5)","v":""},{"$f":"IF($L28=\"\",\"\",'Swam Monthly Report'!$C$4)","v":""},{"$f":"IF($L28=\"\",\"\",'Swam Monthly Report'!$C$3)","v":""},{"$f":"IF($L28=\"\",\"\",'Swam Monthly Report'!$C$8)","v":""},{"$f":"IF($L28=\"\",\"\",'Swam Monthly Report'!$C$2)","v":""},{"$f":"IF($L28=\"\",\"\",'Swam Monthly Report'!$H$2)","v":""},{"$f":"IF($L28=\"\",\"\",'Swam Monthly Report'!$J$2)","v":""},null,null,null,null,null,null,null,null,null,""]
[{"$f":"IF($L29=\"\",\"\",'Swam Monthly Report'!$C$5)","v":""},{"$f":"IF($L29=\"\",\"\",'Swam Monthly Report'!$C$4)","v":""},{"$f":"IF($L29=\"\",\"\",'Swam Monthly Report'!$C$3)","v":""},{"$f":"IF($L29=\"\",\"\",'Swam Monthly Report'!$C$8)","v":""},{"$f":"IF($L29=\"\",\"\",'Swam Monthly Report'!$C$2)","v":""},{"$f":"IF($L29=\"\",\"\",'Swam Monthly Report'!$H$2)","v":""},{"$f":"IF($L29=\"\",\"\",'Swam Monthly Report'!$J$2)","v":""},null,null,null,null,null,null,null,null,null,""]
[{"$f":"IF($L30=\"\",\"\",'Swam Monthly Report'!$C$5)","v":""},{"$f":"IF($L30=\"\",\"\",'Swam Monthly Report'!$C$4)","v":""},{"$f":"IF($L30=\"\",\"\",'Swam Monthly Report'!$C$3)","v":""},{"$f":"IF($L30=\"\",\"\",'Swam Monthly Report'!$C$8)","v":""},{"$f":"IF($L30=\"\",\"\",'Swam Monthly Report'!$C$2)","v":""},{"$f":"IF($L30=\"\",\"\",'Swam Monthly Report'!$H$2)","v":""},{"$f":"IF($L30=\"\",\"\",'Swam Monthly Report'!$J$2)","v":""},null,null,null,null,null,null,null,null,null,""]
[{"$f":"IF($L31=\"\",\"\",'Swam Monthly Report'!$C$5)","v":""},{"$f":"IF($L31=\"\",\"\",'Swam Monthly Report'!$C$4)","v":""},{"$f":"IF($L31=\"\",\"\",'Swam Monthly Report'!$C$3)","v":""},{"$f":"IF($L31=\"\",\"\",'Swam Monthly Report'!$C$8)","v":""},{"$f":"IF($L31=\"\",\"\",'Swam Monthly Report'!$C$2)","v":""},{"$f":"IF($L31=\"\",\"\",'Swam Monthly Report'!$H$2)","v":""},{"$f":"IF($L31=\"\",\"\",'Swam Monthly Report'!$J$2)","v":""},null,null,null,null,null,null,null,null,null,""]
[{"$f":"IF($L32=\"\",\"\",'Swam Monthly Report'!$C$5)","v":""},{"$f":"IF($L32=\"\",\"\",'Swam Monthly Report'!$C$4)","v":""},{"$f":"IF($L32=\"\",\"\",'Swam Monthly Report'!$C$3)","v":""},{"$f":"IF($L32=\"\",\"\",'Swam Monthly Report'!$C$8)","v":""},{"$f":"IF($L32=\"\",\"\",'Swam Monthly Report'!$C$2)","v":""},{"$f":"IF($L32=\"\",\"\",'Swam Monthly Report'!$H$2)","v":""},{"$f":"IF($L32=\"\",\"\",'Swam Monthly Report'!$J$2)","v":""},null,null,null,null,null,null,null,null,null,""]
[{"$f":"IF($L33=\"\",\"\",'Swam Monthly Report'!$C$5)","v":""},{"$f":"IF($L33=\"\",\"\",'Swam Monthly Report'!$C$4)","v":""},{"$f":"IF($L33=\"\",\"\",'Swam Monthly Report'!$C$3)","v":""},{"$f":"IF($L33=\"\",\"\",'Swam Monthly Report'!$C$8)","v":""},{"$f":"IF($L33=\"\",\"\",'Swam Monthly Report'!$C$2)","v":""},{"$f":"IF($L33=\"\",\"\",'Swam Monthly Report'!$H$2)","v":""},{"$f":"IF($L33=\"\",\"\",'Swam Monthly Report'!$J$2)","v":""},null,null,null,null,null,null,null,null,null,""]
[{"$f":"IF($L34=\"\",\"\",'Swam Monthly Report'!$C$5)","v":""},{"$f":"IF($L34=\"\",\"\",'Swam Monthly Report'!$C$4)","v":""},{"$f":"IF($L34=\"\",\"\",'Swam Monthly Report'!$C$3)","v":""},{"$f":"IF($L34=\"\",\"\",'Swam Monthly Report'!$C$8)","v":""},{"$f":"IF($L34=\"\",\"\",'Swam Monthly Report'!$C$2)","v":""},{"$f":"IF($L34=\"\",\"\",'Swam Monthly Report'!$H$2)","v":""},{"$f":"IF($L34=\"\",\"\",'Swam Monthly Report'!$J$2)","v":""},null,null,null,null,null,null,null,null,null,""]
[{"$f":"IF($L35=\"\",\"\",'Swam Monthly Report'!$C$5)","v":""},{"$f":"IF($L35=\"\",\"\",'Swam Monthly Report'!$C$4)","v":""},{"$f":"IF($L35=\"\",\"\",'Swam Monthly Report'!$C$3)","v":""},{"$f":"IF($L35=\"\",\"\",'Swam Monthly Report'!$C$8)","v":""},{"$f":"IF($L35=\"\",\"\",'Swam Monthly Report'!$C$2)","v":""},{"$f":"IF($L35=\"\",\"\",'Swam Monthly Report'!$H$2)","v":""},{"$f":"IF($L35=\"\",\"\",'Swam Monthly Report'!$J$2)","v":""},null,null,null,null,null,null,null,null,null,""]
[{"$f":"IF($L36=\"\",\"\",'Swam Monthly Report'!$C$5)","v":""},{"$f":"IF($L36=\"\",\"\",'Swam Monthly Report'!$C$4)","v":""},{"$f":"IF($L36=\"\",\"\",'Swam Monthly Report'!$C$3)","v":""},{"$f":"IF($L36=\"\",\"\",'Swam Monthly Report'!$C$8)","v":""},{"$f":"IF($L36=\"\",\"\",'Swam Monthly Report'!$C$2)","v":""},{"$f":"IF($L36=\"\",\"\",'Swam Monthly Report'!$H$2)","v":""},{"$f":"IF($L36=\"\",\"\",'Swam Monthly Report'!$J$2)","v":""},null,null,null,null,null,null,null,null,null,""]
[{"$f":"IF($L37=\"\",\"\",'Swam Monthly Report'!$C$5)","v":""},{"$f":"IF($L37=\"\",\"\",'Swam Monthly Report'!$C$4)","v":""},{"$f":"IF($L37=\"\",\"\",'Swam Monthly Report'!$C$3)","v":""},{"$f":"IF($L37=\"\",\"\",'Swam Monthly Report'!$C$8)","v":""},{"$f":"IF($L37=\"\",\"\",'Swam Monthly Report'!$C$2)","v":""},{"$f":"IF($L37=\"\",\"\",'Swam Monthly Report'!$H$2)","v":""},{"$f":"IF($L37=\"\",\"\",'Swam Monthly Report'!$J$2)","v":""},null,null,null,null,null,null,null,null,null,""]
[{"$f":"IF($L38=\"\",\"\",'Swam Monthly Report'!$C$5)","v":""},{"$f":"IF($L38=\"\",\"\",'Swam Monthly Report'!$C$4)","v":""},{"$f":"IF($L38=\"\",\"\",'Swam Monthly Report'!$C$3)","v":""},{"$f":"IF($L38=\"\",\"\",'Swam Monthly Report'!$C$8)","v":""},{"$f":"IF($L38=\"\",\"\",'Swam Monthly Report'!$C$2)","v":""},{"$f":"IF($L38=\"\",\"\",'Swam Monthly Report'!$H$2)","v":""},{"$f":"IF($L38=\"\",\"\",'Swam Monthly Report'!$J$2)","v":""},null,null,null,null,null,null,null,null,null,""]
[{"$f":"IF($L39=\"\",\"\",'Swam Monthly Report'!$C$5)","v":""},{"$f":"IF($L39=\"\",\"\",'Swam Monthly Report'!$C$4)","v":""},{"$f":"IF($L39=\"\",\"\",'Swam Monthly Report'!$C$3)","v":""},{"$f":"IF($L39=\"\",\"\",'Swam Monthly Report'!$C$8)","v":""},{"$f":"IF($L39=\"\",\"\",'Swam Monthly Report'!$C$2)","v":""},{"$f":"IF($L39=\"\",\"\",'Swam Monthly Report'!$H$2)","v":""},{"$f":"IF($L39=\"\",\"\",'Swam Monthly Report'!$J$2)","v":""},null,null,null,null,null,null,null,null,null,""]
[{"$f":"IF($L40=\"\",\"\",'Swam Monthly Report'!$C$5)","v":""},{"$f":"IF($L40=\"\",\"\",'Swam Monthly Report'!$C$4)","v":""},{"$f":"IF($L40=\"\",\"\",'Swam Monthly Report'!$C$3)","v":""},{"$f":"IF($L40=\"\",\"\",'Swam Monthly Report'!$C$8)","v":""},{"$f":"IF($L40=\"\",\"\",'Swam Monthly Report'!$C$2)","v":""},{"$f":"IF($L40=\"\",\"\",'Swam Monthly Report'!$H$2)","v":""},{"$f":"IF($L40=\"\",\"\",'Swam Monthly Report'!$J$2)","v":""},null,null,null,null,null,null,null,null,null,""]
{"$rows_left_out":61}
{"sheet":"Swam Monthly Report","index":1,"n_rows":37,"n_cols":10,"rows_kept":37,"cut":false,"hidden":false,"merged":[[6,2,6,5],[28,5,31,6],[1,2,1,5],[2,2,2,5],[3,2,3,5],[5,2,5,5],[4,2,4,5],[24,1,25,9],[18,1,20,9],[21,1,23,9],[7,2,7,5],[11,1,17,9],[9,2,9,5],[9,6,9,9],[8,2,8,5]]}
[]
[null,"Invoice No.",123456,null,null,null,"For Period From:","2021-11-01","To:","2021-11-30"]
[null,"Name of Contractor:","Contractor A"]
[null,"Project Title:","Project A"]
[null,"Project Code:","204-45678-910"]
[null,"Institution (WM or VIMS):"]
[null,"Project Location:"]
[null,"Contract Total:",1000000]
[null,"Invoice Total:"]
[null,"SWaM Total Amount:",{"$f":"SUMIF('Template Items'!I2:I100,\"SBE\",'Template Items'!P2:P100)+SUMIFS('Template Items'!P2:P100,'Template Items'!J2:J100,\">0\",'Template Items'!I2:I100,\"<>SBE\")","v":0.8},null,null,null,{"$f":"IF(C10=(SUMIF('Template Items'!I2:I100,\"SBE\",'Template Items'!P2:P100)+SUMIFS('Template Items'!P2:P100,'Template Items'!J2:J100,\">0\",'Template Items'!I2:I100,\"<>SBE\")),\"Total matches page 2\",\"Total does not match page 2\")","v":"Total matches page 2"}]
[null,"Comments:"]
[]
[]
[]
[]
[]
[]
[]
[null,"The undersigned hereby affirms and declares that the listed subcontractors actually employed in the performance if work servicesunder this contract, and further that each such firm earned and has been paid the stated amounts for their respective efforts."]
[]
[]
[null,"Contractor shall attach shall include in this workbook a typewritten explanation of any differences in SWaM participation between this form and Proposed SWaM Report, including an accounting for any changes in SWaM firms employed."]
[]
[]
[null,"Under the penalties of perjury I declare that I have read the foregoing conditions and instructions and the facts are true to the best of my knowledge and beliefs."]
[]
[]
[]
[]
[]
[]
[null,null,false,null,null,null,null,"Date:",null,{"$f":"TODAY()","v":"2022-04-25"}]
[]
[]
[]
[null,null,null,null,null,null,null,"Phone:"]
[null,"Name and Title"]

{"sheet":"Form Instructions","index":2,"n_rows":33,"n_cols":23,"rows_kept":33,"cut":false,"hidden":false,"merged":[]}
[]
[]
[null,"1.",null,null,null,null,null,null,null,null,null,"3.",null,null,null,null,null,null,null,null,null,null,"4."]
[]
[]
[]
[]
[]
[]
[]
[]
[]
[]
[]
[]
[]
[]
[]
[]
[]
[]
[]
[]
[]
[]
[]
[]
[]
[]
[]
[]
[]
[null,"2."]

{"sheet":"Email info","index":3,"n_rows":9,"n_cols":3,"rows_kept":9,"cut":false,"hidden":true,"merged":[]}
["Email Recipient:","fpdcap@wm.edu","cindy@vims.edu"]
["Email Recipient CC:"]
["Email Recipient Bcc:","procur@wm.edu","procur@wm.edu"]
["Email Subject:","WM SWaM Monthly Report Submission","VIMS SWaM Monthly Report Submission"]
[]
[]
["Institution:","WM","VIMS"]
[null,"Williamsburg, VA","Gloucester, VA"]
[null,null,"Eastern Shore, VA"]

{"sheet":"S W M Options","index":4,"n_rows":6,"n_cols":1,"rows_kept":6,"cut":false,"hidden":true,"merged":[]}
["S W M"]
["SBE"]
["WSBE"]
["MBE"]
["OBE"]
["Veteran"]